{"text_format":"1","workbook":"xlsx","n_sheets":9,"sheets":["Instructions","Race NS","Race C","Race B","Race A","Boats","ScoreSheet","RSinput","Course"],"not_rendered":{"charts":0,"images":4,"macros":1,"external_links":0,"defined_names":6,"comments":0,"pivot_tables":0},"unopened":[],"bounds":{"document_bytes":16777216,"sheet_cells":100000,"rows_first":2000,"rows_last":500,"rows_between":2000,"halvings":0,"cell_chars":16384,"cell_head_chars":4096},"cells_cut":0,"cells_raw":0,"read":"whole","date_system":"1900"}

{"sheet":"Instructions","index":0,"n_rows":36,"n_cols":5,"rows_kept":36,"cut":false,"hidden":false,"merged":[[14,0,14,14],[0,0,0,14],[1,0,1,14],[2,0,2,14],[3,0,3,14],[4,0,4,14],[8,0,8,14],[9,0,9,14],[10,0,10,14],[11,0,11,14],[12,0,12,14],[13,0,13,14],[15,0,15,14],[16,0,16,14],[17,0,17,14],[18,0,18,14],[19,0,19,14]]}
["Instructions:  Wednesday night racing worksheet"]
["ONLY Enter DATA In The SHADED Areas!!!!"]
["1. Select File - Save As, and Save with the \"File name\" as \"Wed<Date>\", eg \"Wed13Apr16\"."]
["2. Select the Committee Boat Name (use pulldown) and Enter the Race Date."]
["3. Enter the Course (ENTER THE START MARK).  Use the Pulldown List.  The Course Length is automatically calculated."]
[null,"The Start location is assumed to be \"X\".  If the start location is moved then the distance must be manually calculated."]
[null,"If the course does not change for later starts, just leave the course selections blank for those starts.  "]
[null,"If later starts have a different course, enter the new course for each start that is different.  "]
["4. Enter each Yacht Name for the appropriate start.  Use the pulldown list.  The Sail Number and PHRF Rating is automatically   "]
["    completed.  If a Yacht Name is NOT in the pull down list, inquire about their race application and race fees. "]
["5. If the Start Time is different than the default, enter the New Start Time in 24-hour military format: (hr) (min) (sec)."]
["6. Save the File."]
["7. Enter the Finish Time for each boat in 24-hour military format: (hr) (min) (sec). "]
["     If a boat is DNS or DNF, leave the Finish Time as 23:00:00.  Enter the DNS or DNF in the Remarks column to the right of Corrected Time."]
["8. Save the File."]
{"$rows_left_out":22}
{"sheet":"Race NS","index":1,"n_rows":28,"n_cols":20,"rows_kept":28,"cut":false,"hidden":false,"merged":[[10,4,10,6],[3,3,3,5],[2,3,2,7],[9,9,9,11],[10,9,10,11],[6,2,6,3],[7,2,7,3],[5,1,5,3],[7,4,7,5],[4,3,4,19],[9,14,9,18],[10,14,10,18]]}
[]
["   Race Name :  --->",null,null,"Wednesday Night race - xx"]
["  Committee Boat Name -->  "]
[null," Date  -->",null,"xx/xx/xx"]
[null," Conditions --> (optional)",null," "]
[null,"NonSpin Class - Start =    ",null,null,18,30,0]
[null,null,"  Course   =      ",null,"X",null,null,null,null,null,null,null,null,null,"<--  Default start location is 'X'."]
[null,null,"  Distance  =   ",null,{"$f":"IF(ISBLANK(F7), 0, VLOOKUP(E7,Course!$A$23:$T$41, LOOKUP(F7,Course!$A$2:$A$19,Course!$B$2:$B$19),FALSE))+IF(ISBLANK(G7), 0, VLOOKUP(F7,Course!$A$23:$T$41, LOOKUP(G7,Course!$A$2:$A$19,Course!$B$2:$B$19),FALSE))+IF(ISBLANK(J7), 0, VLOOKUP(G7,Course!$A$23:$T$41, LOOKUP(J7,Course!$A$2:$A$19,Course!$B$2:$B$19),FALSE))+IF(ISBLANK(K7), 0, VLOOKUP(J7,Course!$A$23:$T$41, LOOKUP(K7,Course!$A$2:$A$19,Course!$B$2:$B$19),FALSE))+IF(ISBLANK(L7), 0, VLOOKUP(K7,Course!$A$23:$T$41, LOOKUP(L7,Course!$A$2:$A$19,Course!$B$2:$B$19),FALSE))+IF(ISBLANK(M7), 0, VLOOKUP(L7,Course!$A$23:$T$41, LOOKUP(M7,Course!$A$2:$A$19,Course!$B$2:$B$19),FALSE))","v":0},null,null,null,null,null,null,null,null,null,"<--  Override Distance for Windward/Leward courses"]
[null,null,"PHRF Type =  ",null,"NSWL"]
[null,null,null,null,null,null,null,null,null,"Uncorrected",null,null,null,"PHRF","Corrected"]
[null,"Sail","Yacht","PHRF","Finish Time",null,null,null,null,"Elapsed Time",null,null,null,"Allowance","Time",null,null,null,null,"Remarks"]
[null,"Number","Name","Rating","(hr)","(min)","(sec)",null,null,"(hr)","(min)","(sec)",null,"(Sec)","(Total Sec)",null,"(hr)","(min)","(sec)","(DNS/DNF)"]
[1,{"$f":"LOOKUP(C13, Boats!$A$3:B$47,Boats!B$3:B$47)&NSFLAG","v":{"$error":"#N/A"}},null,{"$f":"IF(E$9=\"NSWL\",LOOKUP(C13, Boats!$A$3:D$47,Boats!G$3:G$47),(IF(E$9=\"WL\",LOOKUP(C13, Boats!$A$3:D$47,Boats!E$3:E$47),(IF(E$9=\"NSCR\",LOOKUP(C13, Boats!$A$3:D$47,Boats!H$3:H$47))))))","v":{"$error":"#N/A"}},23,0,0,{"$f":"((E13*60*60+F13*60+G13)-(E$6*60*60+F$6*60+G$6))","v":16200},{"$f":"J13*60*60+K13*60","v":16200},{"$f":"ROUNDDOWN(H13/60/60, 0)","v":4},{"$f":"ROUNDDOWN((H13 - (J13*60*60))/60, 0)","v":30},{"$f":"H13-I13","v":0},null,{"$f":"D13*$E$8","v":{"$error":"#N/A"}},{"$f":"((J13*60+K13)*60+L13)-N13","v":{"$error":"#N/A"}},{"$f":"Q13*60*60+R13*60","v":{"$error":"#N/A"}},{"$f":"ROUNDDOWN(O13/60/60, 0)","v":{"$error":"#N/A"}},{"$f":"ROUNDDOWN((O13 - (Q13*60*60))/60, 0)","v":{"$error":"#N/A"}},{"$f":"O13-P13","v":{"$error":"#N/A"}}]
[2,{"$f":"LOOKUP(C14, Boats!$A$3:B$47,Boats!B$3:B$47)&NSFLAG","v":{"$error":"#N/A"}},null,{"$f":"IF(E$9=\"NSWL\",LOOKUP(C14, Boats!$A$3:D$47,Boats!G$3:G$47),(IF(E$9=\"WL\",LOOKUP(C14, Boats!$A$3:D$47,Boats!E$3:E$47),(IF(E$9=\"NSCR\",LOOKUP(C14, Boats!$A$3:D$47,Boats!H$3:H$47))))))","v":{"$error":"#N/A"}},23,0,0,{"$f":"((E14*60*60+F14*60+G14)-(E$6*60*60+F$6*60+G$6))","v":16200},{"$f":"J14*60*60+K14*60","v":16200},{"$f":"ROUNDDOWN(H14/60/60, 0)","v":4},{"$f":"ROUNDDOWN((H14 - (J14*60*60))/60, 0)","v":30},{"$f":"H14-I14","v":0},null,{"$f":"D14*$E$8","v":{"$error":"#N/A"}},{"$f":"((J14*60+K14)*60+L14)-N14","v":{"$error":"#N/A"}},{"$f":"Q14*60*60+R14*60","v":{"$error":"#N/A"}},{"$f":"ROUNDDOWN(O14/60/60, 0)","v":{"$error":"#N/A"}},{"$f":"ROUNDDOWN((O14 - (Q14*60*60))/60, 0)","v":{"$error":"#N/A"}},{"$f":"O14-P14","v":{"$error":"#N/A"}}]
[3,{"$f":"LOOKUP(C15, Boats!$A$3:B$47,Boats!B$3:B$47)&NSFLAG","v":{"$error":"#N/A"}},null,{"$f":"IF(E$9=\"NSWL\",LOOKUP(C15, Boats!$A$3:D$47,Boats!G$3:G$47),(IF(E$9=\"WL\",LOOKUP(C15, Boats!$A$3:D$47,Boats!E$3:E$47),(IF(E$9=\"NSCR\",LOOKUP(C15, Boats!$A$3:D$47,Boats!H$3:H$47))))))","v":{"$error":"#N/A"}},20,6,6,{"$f":"((E15*60*60+F15*60+G15)-(E$6*60*60+F$6*60+G$6))","v":5766},{"$f":"J15*60*60+K15*60","v":5760},{"$f":"ROUNDDOWN(H15/60/60, 0)","v":1},{"$f":"ROUNDDOWN((H15 - (J15*60*60))/60, 0)","v":36},{"$f":"H15-I15","v":6},null,{"$f":"D15*$E$8","v":{"$error":"#N/A"}},{"$f":"((J15*60+K15)*60+L15)-N15","v":{"$error":"#N/A"}},{"$f":"Q15*60*60+R15*60","v":{"$error":"#N/A"}},{"$f":"ROUNDDOWN(O15/60/60, 0)","v":{"$error":"#N/A"}},{"$f":"ROUNDDOWN((O15 - (Q15*60*60))/60, 0)","v":{"$error":"#N/A"}},{"$f":"O15-P15","v":{"$error":"#N/A"}}]
{"$rows_left_out":14}
{"sheet":"Race C","index":2,"n_rows":28,"n_cols":20,"rows_kept":28,"cut":false,"hidden":false,"merged":[[5,1,5,3],[2,3,2,7],[3,3,3,5],[4,3,4,19],[6,2,6,3],[7,2,7,3],[7,4,7,5],[9,9,9,11],[9,14,9,18],[10,4,10,6],[10,9,10,11],[10,14,10,18]]}
[]
["   Race Name :  --->",null,null,{"$f":"'Race NS'!D2","v":"Wednesday Night race - xx"}]
["  Committee Boat Name -->  ",null,null,{"$f":"'Race NS'!D3","v":0}]
[null," Date  -->",null,{"$f":"'Race NS'!D4","v":"xx/xx/xx"}]
[null," Conditions --> (optional)",null,{"$f":"'Race NS'!D5","v":" "}]
[null,"Spin  'C'  - Start =    ",null,null,18,30,0]
[null,null,"  Course   =      ",null,"X",null,null,null,null,null,null,null,null,null,"Leave course blank if the same as prior section start"]
[null,null,"  Distance  =   ",null,{"$f":"IF(ISBLANK(F7),'Race NS'!$E$8, VLOOKUP( E7,Course!$A$23:$T$41, LOOKUP(F7,Course!$A$2:$A$19,Course!$B$2:$B$19),FALSE))+IF(ISBLANK(G7), 0, VLOOKUP(F7,Course!$A$23:$T$41, LOOKUP(G7,Course!$A$2:$A$19,Course!$B$2:$B$19),FALSE))+IF(ISBLANK(J7), 0, VLOOKUP(G7,Course!$A$23:$T$41, LOOKUP(J7,Course!$A$2:$A$19,Course!$B$2:$B$19),FALSE))+IF(ISBLANK(K7), 0, VLOOKUP(J7,Course!$A$23:$T$41, LOOKUP(K7,Course!$A$2:$A$19,Course!$B$2:$B$19),FALSE))+IF(ISBLANK(L7), 0, VLOOKUP(K7,Course!$A$23:$T$41, LOOKUP(L7,Course!$A$2:$A$19,Course!$B$2:$B$19),FALSE))+IF(ISBLANK(M7), 0, VLOOKUP(L7,Course!$A$23:$T$41, LOOKUP(M7,Course!$A$2:$A$19,Course!$B$2:$B$19),FALSE))","v":0}]
[null,null,"PHRF Type =  ",null,"WL"]
[null,null,null,null,null,null,null,null,null,"Uncorrected",null,null,null,"PHRF","Corrected"]
[null,"Sail","Yacht","PHRF","Finish Time",null,null,null,null,"Elapsed Time",null,null,null,"Allowance","Time",null,null,null,null,"Remarks"]
[null,"Number","Name","Rating","(hr)","(min)","(sec)",null,null,"(hr)","(min)","(sec)",null,"(Sec)","(Total Sec)",null,"(hr)","(min)","(sec)","(DNS/DNF)"]
[1,{"$f":"LOOKUP(C13, Boats!$A$3:B$47,Boats!B$3:B$47)","v":{"$error":"#N/A"}},null,{"$f":"IF(E$9=\"NS\",LOOKUP(C13, Boats!$A$3:D$47,Boats!H$3:H$47),(IF(E$9=\"WL\",LOOKUP(C13, Boats!$A$3:D$47,Boats!E$3:E$47),(IF(E$9=\"CR\",LOOKUP(C13, Boats!$A$3:D$47,Boats!F$3:F$47))))))","v":{"$error":"#N/A"}},23,0,0,{"$f":"((E13*60*60+F13*60+G13)-(E$6*60*60+F$6*60+G$6))","v":16200},{"$f":"J13*60*60+K13*60","v":16200},{"$f":"ROUNDDOWN(H13/60/60, 0)","v":4},{"$f":"ROUNDDOWN((H13 - (J13*60*60))/60, 0)","v":30},{"$f":"H13-I13","v":0},null,{"$f":"D13*$E$8","v":{"$error":"#N/A"}},{"$f":"((J13*60+K13)*60+L13)-N13","v":{"$error":"#N/A"}},{"$f":"Q13*60*60+R13*60","v":{"$error":"#N/A"}},{"$f":"ROUNDDOWN(O13/60/60, 0)","v":{"$error":"#N/A"}},{"$f":"ROUNDDOWN((O13 - (Q13*60*60))/60, 0)","v":{"$error":"#N/A"}},{"$f":"O13-P13","v":{"$error":"#N/A"}}]
[2,{"$f":"LOOKUP(C14, Boats!$A$3:B$47,Boats!B$3:B$47)","v":{"$error":"#N/A"}},null,{"$f":"IF(E$9=\"NS\",LOOKUP(C14, Boats!$A$3:D$47,Boats!H$3:H$47),(IF(E$9=\"WL\",LOOKUP(C14, Boats!$A$3:D$47,Boats!E$3:E$47),(IF(E$9=\"CR\",LOOKUP(C14, Boats!$A$3:D$47,Boats!F$3:F$47))))))","v":{"$error":"#N/A"}},23,0,0,{"$f":"((E14*60*60+F14*60+G14)-(E$6*60*60+F$6*60+G$6))","v":16200},{"$f":"J14*60*60+K14*60","v":16200},{"$f":"ROUNDDOWN(H14/60/60, 0)","v":4},{"$f":"ROUNDDOWN((H14 - (J14*60*60))/60, 0)","v":30},{"$f":"H14-I14","v":0},null,{"$f":"D14*$E$8","v":{"$error":"#N/A"}},{"$f":"((J14*60+K14)*60+L14)-N14","v":{"$error":"#N/A"}},{"$f":"Q14*60*60+R14*60","v":{"$error":"#N/A"}},{"$f":"ROUNDDOWN(O14/60/60, 0)","v":{"$error":"#N/A"}},{"$f":"ROUNDDOWN((O14 - (Q14*60*60))/60, 0)","v":{"$error":"#N/A"}},{"$f":"O14-P14","v":{"$error":"#N/A"}}]
[3,{"$f":"LOOKUP(C15, Boats!$A$3:B$47,Boats!B$3:B$47)","v":{"$error":"#N/A"}},null,{"$f":"IF(E$9=\"NS\",LOOKUP(C15, Boats!$A$3:D$47,Boats!H$3:H$47),(IF(E$9=\"WL\",LOOKUP(C15, Boats!$A$3:D$47,Boats!E$3:E$47),(IF(E$9=\"CR\",LOOKUP(C15, Boats!$A$3:D$47,Boats!F$3:F$47))))))","v":{"$error":"#N/A"}},23,0,0,{"$f":"((E15*60*60+F15*60+G15)-(E$6*60*60+F$6*60+G$6))","v":16200},{"$f":"J15*60*60+K15*60","v":16200},{"$f":"ROUNDDOWN(H15/60/60, 0)","v":4},{"$f":"ROUNDDOWN((H15 - (J15*60*60))/60, 0)","v":30},{"$f":"H15-I15","v":0},null,{"$f":"D15*$E$8","v":{"$error":"#N/A"}},{"$f":"((J15*60+K15)*60+L15)-N15","v":{"$error":"#N/A"}},{"$f":"Q15*60*60+R15*60","v":{"$error":"#N/A"}},{"$f":"ROUNDDOWN(O15/60/60, 0)","v":{"$error":"#N/A"}},{"$f":"ROUNDDOWN((O15 - (Q15*60*60))/60, 0)","v":{"$error":"#N/A"}},{"$f":"O15-P15","v":{"$error":"#N/A"}}]
{"$rows_left_out":14}
{"sheet":"Race B","index":3,"n_rows":28,"n_cols":20,"rows_kept":28,"cut":false,"hidden":false,"merged":[[9,9,9,11],[9,14,9,18],[10,4,10,6],[10,9,10,11],[10,14,10,18],[2,3,2,7],[3,3,3,5],[4,3,4,19],[5,1,5,3],[6,2,6,3],[7,2,7,3],[7,4,7,5]]}
[]
["   Race Name :  --->",null,null,{"$f":"'Race NS'!D2","v":"Wednesday Night race - xx"}]
["  Committee Boat Name -->  ",null,null,{"$f":"'Race NS'!D3","v":0}]
[null," Date  -->",null,{"$f":"'Race NS'!D4","v":"xx/xx/xx"}]
[null," Conditions --> (optional)",null,{"$f":"'Race NS'!D5","v":" "}]
[null,"Spin  'B'  - Start =    ",null,null,18,35,0]
[null,null,"  Course   =      ",null,"X",null,null,null,null,null,null,null,null,null,"Leave course blank if the same as prior section start"]
[null,null,"  Distance  =   ",null,{"$f":"IF(ISBLANK(F7),'Race NS'!$E$8, VLOOKUP( E7,Course!$A$23:$T$41, LOOKUP(F7,Course!$A$2:$A$19,Course!$B$2:$B$19),FALSE))+IF(ISBLANK(G7), 0, VLOOKUP(F7,Course!$A$23:$T$41, LOOKUP(G7,Course!$A$2:$A$19,Course!$B$2:$B$19),FALSE))+IF(ISBLANK(J7), 0, VLOOKUP(G7,Course!$A$23:$T$41, LOOKUP(J7,Course!$A$2:$A$19,Course!$B$2:$B$19),FALSE))+IF(ISBLANK(K7), 0, VLOOKUP(J7,Course!$A$23:$T$41, LOOKUP(K7,Course!$A$2:$A$19,Course!$B$2:$B$19),FALSE))+IF(ISBLANK(L7), 0, VLOOKUP(K7,Course!$A$23:$T$41, LOOKUP(L7,Course!$A$2:$A$19,Course!$B$2:$B$19),FALSE))+IF(ISBLANK(M7), 0, VLOOKUP(L7,Course!$A$23:$T$41, LOOKUP(M7,Course!$A$2:$A$19,Course!$B$2:$B$19),FALSE))","v":0}]
[null,null,"PHRF Type =  ",null,"WL"]
[null,null,null,null,null,null,null,null,null,"Uncorrected",null,null,null,"PHRF","Corrected"]
[null,"Sail","Yacht","PHRF","Finish Time",null,null,null,null,"Elapsed Time",null,null,null,"Allowance","Time",null,null,null,null,"Remarks"]
[null,"Number","Name","Rating","(hr)","(min)","(sec)",null,null,"(hr)","(min)","(sec)",null,"(Sec)","(Total Sec)",null,"(hr)","(min)","(sec)","(DNS/DNF)"]
[1,{"$f":"LOOKUP(C13, Boats!$A$3:B$47,Boats!B$3:B$47)","v":{"$error":"#N/A"}},null,{"$f":"IF(E$9=\"NS\",LOOKUP(C13, Boats!$A$3:D$47,Boats!H$3:H$47),(IF(E$9=\"WL\",LOOKUP(C13, Boats!$A$3:D$47,Boats!E$3:E$47),(IF(E$9=\"CR\",LOOKUP(C13, Boats!$A$3:D$47,Boats!F$3:F$47))))))","v":{"$error":"#N/A"}},23,0,0,{"$f":"((E13*60*60+F13*60+G13)-(E$6*60*60+F$6*60+G$6))","v":15900},{"$f":"J13*60*60+K13*60","v":15900},{"$f":"ROUNDDOWN(H13/60/60, 0)","v":4},{"$f":"ROUNDDOWN((H13 - (J13*60*60))/60, 0)","v":25},{"$f":"H13-I13","v":0},null,{"$f":"D13*$E$8","v":{"$error":"#N/A"}},{"$f":"((J13*60+K13)*60+L13)-N13","v":{"$error":"#N/A"}},{"$f":"Q13*60*60+R13*60","v":{"$error":"#N/A"}},{"$f":"ROUNDDOWN(O13/60/60, 0)","v":{"$error":"#N/A"}},{"$f":"ROUNDDOWN((O13 - (Q13*60*60))/60, 0)","v":{"$error":"#N/A"}},{"$f":"O13-P13","v":{"$error":"#N/A"}}]
[2,{"$f":"LOOKUP(C14, Boats!$A$3:B$47,Boats!B$3:B$47)","v":{"$error":"#N/A"}},null,{"$f":"IF(E$9=\"NS\",LOOKUP(C14, Boats!$A$3:D$47,Boats!H$3:H$47),(IF(E$9=\"WL\",LOOKUP(C14, Boats!$A$3:D$47,Boats!E$3:E$47),(IF(E$9=\"CR\",LOOKUP(C14, Boats!$A$3:D$47,Boats!F$3:F$47))))))","v":{"$error":"#N/A"}},23,0,0,{"$f":"((E14*60*60+F14*60+G14)-(E$6*60*60+F$6*60+G$6))","v":15900},{"$f":"J14*60*60+K14*60","v":15900},{"$f":"ROUNDDOWN(H14/60/60, 0)","v":4},{"$f":"ROUNDDOWN((H14 - (J14*60*60))/60, 0)","v":25},{"$f":"H14-I14","v":0},null,{"$f":"D14*$E$8","v":{"$error":"#N/A"}},{"$f":"((J14*60+K14)*60+L14)-N14","v":{"$error":"#N/A"}},{"$f":"Q14*60*60+R14*60","v":{"$error":"#N/A"}},{"$f":"ROUNDDOWN(O14/60/60, 0)","v":{"$error":"#N/A"}},{"$f":"ROUNDDOWN((O14 - (Q14*60*60))/60, 0)","v":{"$error":"#N/A"}},{"$f":"O14-P14","v":{"$error":"#N/A"}}]
[3,{"$f":"LOOKUP(C15, Boats!$A$3:B$47,Boats!B$3:B$47)","v":{"$error":"#N/A"}},null,{"$f":"IF(E$9=\"NS\",LOOKUP(C15, Boats!$A$3:D$47,Boats!H$3:H$47),(IF(E$9=\"WL\",LOOKUP(C15, Boats!$A$3:D$47,Boats!E$3:E$47),(IF(E$9=\"CR\",LOOKUP(C15, Boats!$A$3:D$47,Boats!F$3:F$47))))))","v":{"$error":"#N/A"}},23,0,0,{"$f":"((E15*60*60+F15*60+G15)-(E$6*60*60+F$6*60+G$6))","v":15900},{"$f":"J15*60*60+K15*60","v":15900},{"$f":"ROUNDDOWN(H15/60/60, 0)","v":4},{"$f":"ROUNDDOWN((H15 - (J15*60*60))/60, 0)","v":25},{"$f":"H15-I15","v":0},null,{"$f":"D15*$E$8","v":{"$error":"#N/A"}},{"$f":"((J15*60+K15)*60+L15)-N15","v":{"$error":"#N/A"}},{"$f":"Q15*60*60+R15*60","v":{"$error":"#N/A"}},{"$f":"ROUNDDOWN(O15/60/60, 0)","v":{"$error":"#N/A"}},{"$f":"ROUNDDOWN((O15 - (Q15*60*60))/60, 0)","v":{"$error":"#N/A"}},{"$f":"O15-P15","v":{"$error":"#N/A"}}]
{"$rows_left_out":14}
{"sheet":"Race A","index":4,"n_rows":28,"n_cols":20,"rows_kept":28,"cut":false,"hidden":false,"merged":[[9,9,9,11],[9,14,9,18],[10,4,10,6],[10,9,10,11],[10,14,10,18],[2,3,2,7],[3,3,3,5],[4,3,4,19],[5,1,5,3],[6,2,6,3],[7,2,7,3],[7,4,7,5]]}
[]
["   Race Name :  --->",null,null,{"$f":"'Race NS'!D2","v":"Wednesday Night race - xx"}]
["  Committee Boat Name -->  ",null,null,{"$f":"'Race NS'!D3","v":0}]
[null," Date  -->",null,{"$f":"'Race NS'!D4","v":"xx/xx/xx"}]
[null," Conditions --> (optional)",null,{"$f":"'Race NS'!D5","v":" "}]
[null,"Spin  'A'  - Start =    ",null,null,18,40,0]
[null,null,"  Course   =      ",null,"X",null,null,null,null,null,null,null,null,null,"Leave course blank if the same as prior section start"]
[null,null,"  Distance  =   ",null,{"$f":"IF(ISBLANK(F7),'Race NS'!$E$8, VLOOKUP( E7,Course!$A$23:$T$41, LOOKUP(F7,Course!$A$2:$A$19,Course!$B$2:$B$19),FALSE))+IF(ISBLANK(G7), 0, VLOOKUP(F7,Course!$A$23:$T$41, LOOKUP(G7,Course!$A$2:$A$19,Course!$B$2:$B$19),FALSE))+IF(ISBLANK(J7), 0, VLOOKUP(G7,Course!$A$23:$T$41, LOOKUP(J7,Course!$A$2:$A$19,Course!$B$2:$B$19),FALSE))+IF(ISBLANK(K7), 0, VLOOKUP(J7,Course!$A$23:$T$41, LOOKUP(K7,Course!$A$2:$A$19,Course!$B$2:$B$19),FALSE))+IF(ISBLANK(L7), 0, VLOOKUP(K7,Course!$A$23:$T$41, LOOKUP(L7,Course!$A$2:$A$19,Course!$B$2:$B$19),FALSE))+IF(ISBLANK(M7), 0, VLOOKUP(L7,Course!$A$23:$T$41, LOOKUP(M7,Course!$A$2:$A$19,Course!$B$2:$B$19),FALSE))","v":0}]
[null,null,"PHRF Type =  ",null,"WL"]
[null,null,null,null,null,null,null,null,null,"Uncorrected",null,null,null,"PHRF","Corrected"]
[null,"Sail","Yacht","PHRF","Finish Time",null,null,null,null,"Elapsed Time",null,null,null,"Allowance","Time",null,null,null,null,"Remarks"]
[null,"Number","Name","Rating","(hr)","(min)","(sec)",null,null,"(hr)","(min)","(sec)",null,"(Sec)","(Total Sec)",null,"(hr)","(min)","(sec)","(DNS/DNF)"]
[1,{"$f":"LOOKUP(C13, Boats!$A$3:B$47,Boats!B$3:B$47)","v":{"$error":"#N/A"}},null,{"$f":"IF(E$9=\"NS\",LOOKUP(C13, Boats!$A$3:D$47,Boats!H$3:H$47),(IF(E$9=\"WL\",LOOKUP(C13, Boats!$A$3:D$47,Boats!E$3:E$47),(IF(E$9=\"CR\",LOOKUP(C13, Boats!$A$3:D$47,Boats!F$3:F$47))))))","v":{"$error":"#N/A"}},23,0,0,{"$f":"((E13*60*60+F13*60+G13)-(E$6*60*60+F$6*60+G$6))","v":15600},{"$f":"J13*60*60+K13*60","v":15600},{"$f":"ROUNDDOWN(H13/60/60, 0)","v":4},{"$f":"ROUNDDOWN((H13 - (J13*60*60))/60, 0)","v":20},{"$f":"H13-I13","v":0},null,{"$f":"D13*$E$8","v":{"$error":"#N/A"}},{"$f":"((J13*60+K13)*60+L13)-N13","v":{"$error":"#N/A"}},{"$f":"Q13*60*60+R13*60","v":{"$error":"#N/A"}},{"$f":"ROUNDDOWN(O13/60/60, 0)","v":{"$error":"#N/A"}},{"$f":"ROUNDDOWN((O13 - (Q13*60*60))/60, 0)","v":{"$error":"#N/A"}},{"$f":"O13-P13","v":{"$error":"#N/A"}}]
[2,{"$f":"LOOKUP(C14, Boats!$A$3:B$47,Boats!B$3:B$47)","v":{"$error":"#N/A"}},null,{"$f":"IF(E$9=\"NS\",LOOKUP(C14, Boats!$A$3:D$47,Boats!H$3:H$47),(IF(E$9=\"WL\",LOOKUP(C14, Boats!$A$3:D$47,Boats!E$3:E$47),(IF(E$9=\"CR\",LOOKUP(C14, Boats!$A$3:D$47,Boats!F$3:F$47))))))","v":{"$error":"#N/A"}},23,0,0,{"$f":"((E14*60*60+F14*60+G14)-(E$6*60*60+F$6*60+G$6))","v":15600},{"$f":"J14*60*60+K14*60","v":15600},{"$f":"ROUNDDOWN(H14/60/60, 0)","v":4},{"$f":"ROUNDDOWN((H14 - (J14*60*60))/60, 0)","v":20},{"$f":"H14-I14","v":0},null,{"$f":"D14*$E$8","v":{"$error":"#N/A"}},{"$f":"((J14*60+K14)*60+L14)-N14","v":{"$error":"#N/A"}},{"$f":"Q14*60*60+R14*60","v":{"$error":"#N/A"}},{"$f":"ROUNDDOWN(O14/60/60, 0)","v":{"$error":"#N/A"}},{"$f":"ROUNDDOWN((O14 - (Q14*60*60))/60, 0)","v":{"$error":"#N/A"}},{"$f":"O14-P14","v":{"$error":"#N/A"}}]
[3,{"$f":"LOOKUP(C15, Boats!$A$3:B$47,Boats!B$3:B$47)","v":{"$error":"#N/A"}},null,{"$f":"IF(E$9=\"NS\",LOOKUP(C15, Boats!$A$3:D$47,Boats!H$3:H$47),(IF(E$9=\"WL\",LOOKUP(C15, Boats!$A$3:D$47,Boats!E$3:E$47),(IF(E$9=\"CR\",LOOKUP(C15, Boats!$A$3:D$47,Boats!F$3:F$47))))))","v":{"$error":"#N/A"}},23,0,0,{"$f":"((E15*60*60+F15*60+G15)-(E$6*60*60+F$6*60+G$6))","v":15600},{"$f":"J15*60*60+K15*60","v":15600},{"$f":"ROUNDDOWN(H15/60/60, 0)","v":4},{"$f":"ROUNDDOWN((H15 - (J15*60*60))/60, 0)","v":20},{"$f":"H15-I15","v":0},null,{"$f":"D15*$E$8","v":{"$error":"#N/A"}},{"$f":"((J15*60+K15)*60+L15)-N15","v":{"$error":"#N/A"}},{"$f":"Q15*60*60+R15*60","v":{"$error":"#N/A"}},{"$f":"ROUNDDOWN(O15/60/60, 0)","v":{"$error":"#N/A"}},{"$f":"ROUNDDOWN((O15 - (Q15*60*60))/60, 0)","v":{"$error":"#N/A"}},{"$f":"O15-P15","v":{"$error":"#N/A"}}]
{"$rows_left_out":14}
{"sheet":"Boats","index":5,"n_rows":103,"n_cols":22,"rows_kept":103,"cut":false,"hidden":false,"merged":[[0,4,0,7]]}
[null,"N",null,null,"PHRF"]
["Boat","SailNo","Owner","email","Spin - WL","Spin - CR","NonSpin-WL","NonSpin-CR","Race Fee","Spinclass","I","J","P","E","LOA","LWL","Disp","UpSAD","DWSAD","DLWL"]
[null,null,null,null,null,null,null,null,null,null,null,null,null,null,null,null,null,null,null,null,{"$f":"SUM(U4:U40)","v":23}]
["American Flyer",39519,"Dan Schneider","dc_schneider@msn.com",36,36,42,42,"no","A",51.25,14.04,50.45,18.47,39.4,34.119999999999997,13000,29.96,63.34,146.10607247052599,null,"American Flyer"]
["Arctic Tern",93642,"PAX",null,168,168,168,168,"yes","C",null,null,null,null,null,null,null,null,null,null,1]
["Bad Cat","063","Jim Whited","jimw625@comcast.net",39,33,48,48,"yes","A",48.36,13.84,45.17,45.17,36.5,32.700000000000003,9300,23.92,70.47,118.74,1]
["Badger",144,"Carl Feusaherns","feus@comcast.net",177,177,177,177,"yes","C",30.5,9.5,29.42,12.29,25.9,21.7,4250,19.829999999999998,41.94,185.68,1]
["Blue Boat Home",4856,"Lowell Martin",null,231,231,231,231,"yes","C",34,11.25,28.67,10.5,26.8,21.8,6850,15.14,35.43,295.17,1]
["Blue Goose",93643,"PAX",null,168,168,168,168,"no","C"]
["Cheetah",50473,"Marc Briere","race@smsa.com",36,30,45,45,"yes","A",43.7,12.6,44.7,16.5,35.86,31.76,8150,25.41,73.319999999999993,113.14,1]
["Easy Button",93084,"David Meiser","meiser@comcast.net",159,162,159,159,"yes","C",27.75,8.25,29.75,11.72,25.7,20,2600,24.41,49.25,145.08928571428601,1]
["Elan",43162,"Gary Shaw","garyshaw75@aol.com",153,153,153,153,"yes","C",49.5,15.33,42,11,36.83,29.5,13500,18.71,39.33,234.75762231915499,1]
["Flyer",25126,"Michael Major","mjamesmajor@gmail.com",111,111,114,114,"no","B",40.18,11.65,42.27,15.79,34.4,27.2,8825,21.24,39.65,195.78]
["J Ray","USA47","Larry Ray","mlray@gmail.com",114,111,120,120,"yes","B",26.77,7.68,26.16,9.44,22.8,20.5,1750,29.6,43,90.68,1]
["Juggernaut",51277,"David Ahearn",null,39,39,39,39,"no","A",50.82,14.7,51.75,16.5,37.700000000000003,34.200000000000003,11400,25.24,71.02,127.23]
{"$rows_left_out":89}
{"sheet":"ScoreSheet","index":6,"n_rows":42,"n_cols":13,"rows_kept":42,"cut":false,"hidden":false,"merged":[[0,0,0,3],[2,2,2,4],[0,4,0,9]]}
["SMSA Scoring Worksheet",null,null,null,"Race Name _________________________________"]
[null,"Date : ","_____________________",null,null,"RC: ","____________________"]
[null,"Course: ","_______________________________________",null,null,null,null,null,null,null,"Finish time"]
["Boat","SailNo","Owner","Spin","NonSpin","Race Fee","Spinclass","Checked In","Start Class ","(hr)","(min)","(sec)","Notes"]
[" "," "," "," "," "," "," "]
[{"$f":"Boats!A4","v":"American Flyer"},{"$f":"Boats!B4","v":39519},{"$f":"Boats!C4","v":"Dan Schneider"},{"$f":"Boats!E4","v":36},{"$f":"Boats!H4","v":42},{"$f":"Boats!I4","v":"no"},{"$f":"Boats!J4","v":"A"}]
[{"$f":"Boats!A5","v":"Arctic Tern"},{"$f":"Boats!B5","v":93642},{"$f":"Boats!C5","v":"PAX"},{"$f":"Boats!E5","v":168},{"$f":"Boats!H5","v":168},{"$f":"Boats!I5","v":"yes"},{"$f":"Boats!J5","v":"C"}]
[{"$f":"Boats!A6","v":"Bad Cat"},{"$f":"Boats!B6","v":"063"},{"$f":"Boats!C6","v":"Jim Whited"},{"$f":"Boats!E6","v":39},{"$f":"Boats!H6","v":48},{"$f":"Boats!I6","v":"yes"},{"$f":"Boats!J6","v":"A"}]
[{"$f":"Boats!A7","v":"Badger"},{"$f":"Boats!B7","v":144},{"$f":"Boats!C7","v":"Carl Feusaherns"},{"$f":"Boats!E7","v":177},{"$f":"Boats!H7","v":177},{"$f":"Boats!I7","v":"yes"},{"$f":"Boats!J7","v":"C"}]
[{"$f":"Boats!A8","v":"Blue Boat Home"},{"$f":"Boats!B8","v":4856},{"$f":"Boats!C8","v":"Lowell Martin"},{"$f":"Boats!E8","v":231},{"$f":"Boats!H8","v":231},{"$f":"Boats!I8","v":"yes"},{"$f":"Boats!J8","v":"C"}]
[{"$f":"Boats!A9","v":"Blue Goose"},{"$f":"Boats!B9","v":93643},{"$f":"Boats!C9","v":"PAX"},{"$f":"Boats!E9","v":168},{"$f":"Boats!H9","v":168},{"$f":"Boats!I9","v":"no"},{"$f":"Boats!J9","v":"C"}]
[{"$f":"Boats!A10","v":"Cheetah"},{"$f":"Boats!B10","v":50473},{"$f":"Boats!C10","v":"Marc Briere"},{"$f":"Boats!E10","v":36},{"$f":"Boats!H10","v":45},{"$f":"Boats!I10","v":"yes"},{"$f":"Boats!J10","v":"A"}]
[{"$f":"Boats!A11","v":"Easy Button"},{"$f":"Boats!B11","v":93084},{"$f":"Boats!C11","v":"David Meiser"},{"$f":"Boats!E11","v":159},{"$f":"Boats!H11","v":159},{"$f":"Boats!I11","v":"yes"},{"$f":"Boats!J11","v":"C"}]
[{"$f":"Boats!A12","v":"Elan"},{"$f":"Boats!B12","v":43162},{"$f":"Boats!C12","v":"Gary Shaw"},{"$f":"Boats!E12","v":153},{"$f":"Boats!H12","v":153},{"$f":"Boats!I12","v":"yes"},{"$f":"Boats!J12","v":"C"}]
[{"$f":"Boats!A13","v":"Flyer"},{"$f":"Boats!B13","v":25126},{"$f":"Boats!C13","v":"Michael Major"},{"$f":"Boats!E13","v":111},{"$f":"Boats!H13","v":114},{"$f":"Boats!I13","v":"no"},{"$f":"Boats!J13","v":"B"}]
{"$rows_left_out":28}
{"sheet":"RSinput","index":7,"n_rows":1,"n_cols":8,"rows_kept":1,"cut":false,"hidden":false,"merged":[]}
["Sail","BoatName","PHRF",null,null,null,"Finish","Division"]

{"sheet":"Course","index":8,"n_rows":50,"n_cols":20,"rows_kept":50,"cut":false,"hidden":false,"merged":[]}
[null,20,20,null,null,null,20,20,null,null,20,20]
[null,20,20,null,null,"A",2,2,null,"A",2,2,null,"Page has been customized for Wednesday night MARKS"]
["A",2,2,null,null,"B",3,3,null,"B",3,3]
["B",3,3,null,null,"C",4,4,null,"E",5,5]
["E",5,5,null,null,"E",5,5,null,"K",10,10]
["K",10,10,null,null,"G",6,6,null,"L",11,11]
["L",11,11,null,null,"H",7,7,null,"M",12,12]
["M",12,12,null,null,"I",8,8,null,"S",17,17]
["S",17,17,null,null,"J",9,9,null,"T",14,14]
["T",14,14,null,null,"K",10,10,null,"X",16,16]
["V",16,16,null,null,"L",11,11,null,"Y",18,18]
["X",20,20,null,null,"M",12,12,null,"Z",19,19]
["Y",18,18,null,null,"S",17,17]
["Z",19,19,null,null,"T",14,14]
[null,null,null,null,null,"V",16,16]
{"$rows_left_out":35}